{"text_format":"1","workbook":"xlsx","n_sheets":3,"sheets":["FORMULÁRIO DE INSCRIÇÃO","BANCO DE DADOS","estados e municípios"],"not_rendered":{"charts":0,"images":2,"macros":1,"external_links":0,"defined_names":3,"comments":1,"pivot_tables":0},"unopened":[],"bounds":{"document_bytes":16777216,"sheet_cells":100000,"rows_first":2000,"rows_last":500,"rows_between":2000,"halvings":0,"cell_chars":16384,"cell_head_chars":4096},"cells_cut":0,"cells_raw":0,"read":"whole","date_system":"1900"}

{"sheet":"FORMULÁRIO DE INSCRIÇÃO","index":0,"n_rows":39,"n_cols":10,"rows_kept":39,"cut":false,"hidden":false,"merged":[[1,1,2,7],[3,1,3,7],[5,1,5,7],[6,3,6,5],[6,6,6,7],[7,3,7,5],[7,6,7,7],[9,1,9,7],[10,2,10,7],[11,6,11,7],[13,1,13,7],[14,2,14,7],[15,2,15,7],[16,2,16,7],[18,1,18,7],[19,2,19,3],[19,4,19,5],[20,2,20,3],[20,4,20,5],[21,2,21,3],[22,2,22,3],[23,2,23,3],[31,2,31,3],[32,2,32,3],[33,2,33,3],[34,2,34,3],[35,2,35,3],[24,2,24,3],[25,2,25,3],[26,2,26,3],[27,2,27,3],[28,2,28,3],[29,2,29,3],[30,2,30,3],[21,4,21,5],[22,4,22,5],[23,4,23,5],[24,4,24,5],[32,4,32,5],[33,4,33,5],[34,4,34,5],[35,4,35,5],[25,4,25,5],[26,4,26,5],[27,4,27,5],[28,4,28,5],[29,4,29,5],[30,4,30,5],[31,4,31,5]]}
[]
[null,"PROJETO MPT NA ESCOLA"]
[]
[null," - FICHA DE PARTICIPAÇÃO 2026 -"]
[]
[null,"IDENTIFICAÇÃO DO ENTE PARTICIPANTE"]
[null,"ESTADO:","SP","MUNICÍPIO:",null,null,"São Paulo"]
[null,"SECRETARIA DE EDUCAÇÃO MUNICIPAL OU ESTADUAL?","Estadual","NOME DO(A) SECRETÁRIO(A) DE EDUCAÇÃO:",null,null,"Renato Feder"]
[]
[null,"IDENTIFICAÇÃO DO(A) COORDENADOR(A) LOCAL DO PROJETO"]
[null,"NOME:"]
[null,"TELEFONE:",null,"CELULAR:",null,"E-MAIL:"]
[]
[null,"DADOS ABSOLUTOS DO MUNICÍPIO PARTICIPANTE"]
[null,"QUANTIDADE TOTAL DE ESCOLAS DO MUNICÍPIO:"]
[null,"QUANTIDADE TOTAL DE EDUCADORES(AS) DO MUNICÍPIO:"]
[null,"QUANTIDADE TOTAL DE ALUNOS(AS) DO MUNICÍPIO:"]
[]
[null,"DADOS DAS ESCOLAS PARTICIPANTES DO PROJETO"]
[null,"NOME DA ESCOLA","Nº DE EDUCADORES(AS) PARTICIPANTES",null,"Nº DE ALUNOS(AS) PARTICIPANTES",null,"SÉRIE/ANO","TEMA"]
[null,null,null,null,null,null,null,null,null,{"$f":"VLOOKUP(G21,'estados e municípios'!$E$36:$G$38,3)","v":"#N/A"}]
[null,null,null,null,null,null,null,null,null,{"$f":"VLOOKUP(G22,'estados e municípios'!$E$36:$G$39,3)","v":"#N/A"}]
[null,null,null,null,null,null,null,null,null,{"$f":"VLOOKUP(G23,'estados e municípios'!$E$36:$G$39,3)","v":"#N/A"}]
[null,null,null,null,null,null,null,null,null,{"$f":"VLOOKUP(G24,'estados e municípios'!$E$36:$G$39,3)","v":"#N/A"}]
[null,null,null,null,null,null,null,null,null,{"$f":"VLOOKUP(G25,'estados e municípios'!$E$36:$G$39,3)","v":"#N/A"}]
[null,null,null,null,null,null,null,null,null,{"$f":"VLOOKUP(G26,'estados e municípios'!$E$36:$G$39,3)","v":"#N/A"}]
[null,null,null,null,null,null,null,null,null,{"$f":"VLOOKUP(G27,'estados e municípios'!$E$36:$G$39,3)","v":"#N/A"}]
[null,null,null,null,null,null,null,null,null,{"$f":"VLOOKUP(G28,'estados e municípios'!$E$36:$G$39,3)","v":"#N/A"}]
[null,null,null,null,null,null,null,null,null,{"$f":"VLOOKUP(G29,'estados e municípios'!$E$36:$G$39,3)","v":"#N/A"}]
[null,null,null,null,null,null,null,null,null,{"$f":"VLOOKUP(G30,'estados e municípios'!$E$36:$G$39,3)","v":"#N/A"}]
{"$rows_left_out":10}
{"sheet":"BANCO DE DADOS","index":1,"n_rows":101,"n_cols":16,"rows_kept":101,"cut":false,"hidden":true,"merged":[[1,7,100,7],[1,8,100,8],[1,9,100,9],[1,10,100,10],[1,0,100,0],[1,1,100,1],[1,2,100,2],[1,3,100,3],[1,4,100,4],[1,5,100,5],[1,6,100,6]]}
["ESTADO:","MUNICÍPIO:","ESFERA DE GOVERNO:","SECRETÁRIO(A):","NOME:","TELEFONE:","CELULAR:","E-MAIL:","TOTAL ESCOLAS","TOTAL EDUCADORES(AS)","TOTAL ALUNOS(AS)","ESCOLA","EDUCADORES(AS) PARTICIPANTES","ALUNOS(AS) PARTICIPANTES","SÉRIE/ANO","TEMA"]
[{"$f":"'FORMULÁRIO DE INSCRIÇÃO'!C7","v":"SP"},{"$f":"'FORMULÁRIO DE INSCRIÇÃO'!G7","v":"São Paulo"},{"$f":"'FORMULÁRIO DE INSCRIÇÃO'!C8","v":"Estadual"},{"$f":"'FORMULÁRIO DE INSCRIÇÃO'!G8","v":"Renato Feder"},{"$f":"'FORMULÁRIO DE INSCRIÇÃO'!C11","v":""},{"$f":"'FORMULÁRIO DE INSCRIÇÃO'!C12","v":""},{"$f":"'FORMULÁRIO DE INSCRIÇÃO'!E12","v":""},{"$f":"'FORMULÁRIO DE INSCRIÇÃO'!G12","v":""},{"$f":"'FORMULÁRIO DE INSCRIÇÃO'!C15","v":""},{"$f":"'FORMULÁRIO DE INSCRIÇÃO'!C16","v":""},{"$f":"'FORMULÁRIO DE INSCRIÇÃO'!C17","v":""},{"$f":"'FORMULÁRIO DE INSCRIÇÃO'!B21","v":""},{"$f":"'FORMULÁRIO DE INSCRIÇÃO'!C21","v":""},{"$f":"'FORMULÁRIO DE INSCRIÇÃO'!E21","v":""},{"$f":"'FORMULÁRIO DE INSCRIÇÃO'!G21","v":""},{"$f":"'FORMULÁRIO DE INSCRIÇÃO'!H21","v":""}]
[null,null,null,null,null,null,null,null,null,null,null,{"$f":"#REF!","v":"#REF!"},"#REF!","#REF!","#REF!","#REF!"]
[null,null,null,null,null,null,null,null,null,null,null,{"$f":"#REF!","v":"#REF!"},"#REF!","#REF!","#REF!","#REF!"]
[null,null,null,null,null,null,null,null,null,null,null,{"$f":"#REF!","v":"#REF!"},"#REF!","#REF!","#REF!","#REF!"]
[null,null,null,null,null,null,null,null,null,null,null,{"$f":"#REF!","v":"#REF!"},"#REF!","#REF!","#REF!","#REF!"]
[null,null,null,null,null,null,null,null,null,null,null,{"$f":"#REF!","v":"#REF!"},"#REF!","#REF!","#REF!","#REF!"]
[null,null,null,null,null,null,null,null,null,null,null,{"$f":"#REF!","v":"#REF!"},"#REF!","#REF!","#REF!","#REF!"]
[null,null,null,null,null,null,null,null,null,null,null,{"$f":"#REF!","v":"#REF!"},"#REF!","#REF!","#REF!","#REF!"]
[null,null,null,null,null,null,null,null,null,null,null,{"$f":"#REF!","v":"#REF!"},"#REF!","#REF!","#REF!","#REF!"]
[null,null,null,null,null,null,null,null,null,null,null,{"$f":"#REF!","v":"#REF!"},"#REF!","#REF!","#REF!","#REF!"]
[null,null,null,null,null,null,null,null,null,null,null,{"$f":"#REF!","v":"#REF!"},"#REF!","#REF!","#REF!","#REF!"]
[null,null,null,null,null,null,null,null,null,null,null,{"$f":"#REF!","v":"#REF!"},"#REF!","#REF!","#REF!","#REF!"]
[null,null,null,null,null,null,null,null,null,null,null,{"$f":"#REF!","v":"#REF!"},"#REF!","#REF!","#REF!","#REF!"]
[null,null,null,null,null,null,null,null,null,null,null,{"$f":"#REF!","v":"#REF!"},"#REF!","#REF!","#REF!","#REF!"]
[null,null,null,null,null,null,null,null,null,null,null,{"$f":"#REF!","v":"#REF!"},"#REF!","#REF!","#REF!","#REF!"]
[null,null,null,null,null,null,null,null,null,null,null,{"$f":"#REF!","v":"#REF!"},"#REF!","#REF!","#REF!","#REF!"]
[null,null,null,null,null,null,null,null,null,null,null,{"$f":"#REF!","v":"#REF!"},"#REF!","#REF!","#REF!","#REF!"]
[null,null,null,null,null,null,null,null,null,null,null,{"$f":"#REF!","v":"#REF!"},"#REF!","#REF!","#REF!","#REF!"]
[null,null,null,null,null,null,null,null,null,null,null,{"$f":"#REF!","v":"#REF!"},"#REF!","#REF!","#REF!","#REF!"]
[null,null,null,null,null,null,null,null,null,null,null,{"$f":"#REF!","v":"#REF!"},"#REF!","#REF!","#REF!","#REF!"]
[null,null,null,null,null,null,null,null,null,null,null,{"$f":"#REF!","v":"#REF!"},"#REF!","#REF!","#REF!","#REF!"]
[null,null,null,null,null,null,null,null,null,null,null,{"$f":"#REF!","v":"#REF!"},"#REF!","#REF!","#REF!","#REF!"]
[null,null,null,null,null,null,null,null,null,null,null,{"$f":"#REF!","v":"#REF!"},"#REF!","#REF!","#REF!","#REF!"]
[null,null,null,null,null,null,null,null,null,null,null,{"$f":"#REF!","v":"#REF!"},"#REF!","#REF!","#REF!","#REF!"]
[null,null,null,null,null,null,null,null,null,null,null,{"$f":"#REF!","v":"#REF!"},"#REF!","#REF!","#REF!","#REF!"]
[null,null,null,null,null,null,null,null,null,null,null,{"$f":"#REF!","v":"#REF!"},"#REF!","#REF!","#REF!","#REF!"]
[null,null,null,null,null,null,null,null,null,null,null,{"$f":"#REF!","v":"#REF!"},"#REF!","#REF!","#REF!","#REF!"]
[null,null,null,null,null,null,null,null,null,null,null,{"$f":"#REF!","v":"#REF!"},"#REF!","#REF!","#REF!","#REF!"]
[null,null,null,null,null,null,null,null,null,null,null,{"$f":"#REF!","v":"#REF!"},"#REF!","#REF!","#REF!","#REF!"]
{"$rows_left_out":72}
{"sheet":"estados e municípios","index":2,"n_rows":5571,"n_cols":37,"rows_kept":5571,"cut":false,"hidden":true,"merged":[]}
[1.0,"UF","Selecione o Município",1.0,"Selecione a UF",null,"GRUPO 1 (4º ANO E 5º ANO)","GRUPO 2 (6º ANO E 7º ANO)","GRUPO 3 (8º ANO E 9º ANO)",null,"AC","AL","AM","AP","BA","CE","DF","ES","GO","MA","MG","MS","MT","PA","PB","PE","PI","PR","RJ","RN","RO","RR","RS","SC","SE","SP","TO"]
[2.0,"AC","Acrelândia",2.0,"AC",null,"Trabalho Infantil","Aprendizagem Profissional","Saúde e Segurança no Trabalho",null," Selecione a UF"," Selecione a UF"," Selecione a UF"," Selecione a UF"," Selecione a UF"," Selecione a UF"," Selecione a UF"," Selecione a UF"," Selecione a UF"," Selecione a UF"," Selecione a UF"," Selecione a UF"," Selecione a UF"," Selecione a UF"," Selecione a UF"," Selecione a UF"," Selecione a UF"," Selecione a UF"," Selecione a UF"," Selecione a UF"," Selecione a UF"," Selecione a UF"," Selecione a UF"," Selecione a UF"," Selecione a UF"," Selecione a UF"," Selecione a UF"]
[3.0,"AC","Assis Brasil",3.0,"AL",null,"Trabalho Infantil na Reciclagem",null,null,null,"Acrelândia","Água Branca","Alvarães","Amapá","Abaíra","Abaiara","Brasília","Afonso Cláudio","Abadia de Goiás","Açailândia","Abadia dos Dourados","Água Clara","Acorizal","Abaetetuba","Água Branca","Abreu e Lima","Acauã","Abatiá","Angra dos Reis","Acari","Alta Floresta DOeste","Alto Alegre","Aceguá","Abdon Batista","Amparo de São Francisco","Adamantina","Abreulândia"]
[4.0,"AC","Brasiléia",4.0,"AM",null,null,null,null,null,"Assis Brasil","Anadia","Amaturá","Calçoene","Abaré","Acarape",null,"Água Doce do Norte","Abadiânia","Afonso Cunha","Abaeté","Alcinópolis","Água Boa","Abel Figueiredo","Aguiar","Afogados da Ingazeira","Agricolândia","Adrianópolis","Aperibé","Açu","Alto Alegre dos Parecis","Amajari","Água Santa","Abelardo Luz","Aquidabã","Adolfo","Aguiarnópolis"]
[5.0,"AC","Bujari",5.0,"AP",null,null,null,null,null,"Brasiléia","Arapiraca","Anamã","Cutias","Acajutiba","Acaraú",null,"Águia Branca","Acreúna","Água Doce do Maranhão","Abre Campo","Amambaí","Alta Floresta","Acará","Alagoa Grande","Afrânio","Água Branca","Agudos do Sul","Araruama","Afonso Bezerra","Alto Paraíso","Boa Vista","Agudo","Agrolândia","Aracaju","Aguaí","Aliança do Tocantins"]
[6.0,"AC","Capixaba",6.0,"BA",null,null,null,null,null,"Bujari","Atalaia","Anori","Ferreira Gomes","Adustina","Acopiara",null,"Alegre","Adelândia","Alcântara","Acaiaca","Anastácio","Alto Araguaia","Afuá","Alagoa Nova","Agrestina","Alagoinha do Piauí","Almirante Tamandaré","Areal","Água Nova","Alvorada DOeste","Bonfim","Ajuricaba","Agronômica","Arauá","Águas da Prata","Almas"]
[7.0,"AC","Cruzeiro do Sul",7.0,"CE",null,null,null,null,null,"Capixaba","Barra de Santo Antônio","Apuí","Itaubal","Água Fria","Aiuaba",null,"Alfredo Chaves","Água Fria de Goiás","Aldeias Altas","Açucena","Anaurilândia","Alto Boa Vista","Água Azul do Norte","Alagoinha","Água Preta","Alegrete do Piauí","Altamira do Paraná","Armação dos Búzios","Alexandria","Ariquemes","Cantá","Alecrim","Água Doce","Areia Branca","Águas de Lindóia","Alvorada"]
[8.0,"AC","Epitaciolândia",8.0,"DF",null,null,null,null,null,"Cruzeiro do Sul","Barra de São Miguel","Atalaia do Norte","Laranjal do Jari","Aiquara","Alcântaras",null,"Alto Rio Novo","Água Limpa","Altamira do Maranhão","Água Boa","Angélica","Alto Garças","Alenquer","Alcantil","Águas Belas","Alto Longá","Alto Paraíso","Arraial do Cabo","Almino Afonso","Buritis","Caracaraí","Alegrete","Águas de Chapecó","Barra dos Coqueiros","Águas de Santa Bárbara","Ananás"]
[9.0,"AC","Feijó",9.0,"ES",null,null,null,null,null,"Epitaciolândia","Batalha","Autazes","Macapá","Alagoinhas","Altaneira",null,"Anchieta","Águas Lindas de Goiás","Alto Alegre do Maranhão","Água Comprida","Antônio João","Alto Paraguai","Almeirim","Algodão de Jandaíra","Alagoinha","Altos","Alto Paraná","Barra do Piraí","Alto do Rodrigues","Cabixi","Caroebe","Alegria","Águas Frias","Boquim","Águas de São Pedro","Angico"]
[10.0,"AC","Jordão",10.0,"GO",null,null,null,null,null,"Feijó","Belém","Barcelos","Mazagão","Alcobaça","Alto Santo",null,"Apiacá","Alexânia","Alto Alegre do Pindaré","Aguanil","Aparecida do Taboado","Alto Taquari","Altamira","Alhandra","Aliança","Alvorada do Gurguéia","Alto Piquiri","Barra Mansa","Angicos","Cacaulândia","Iracema","Almirante Tamandaré do Sul","Águas Mornas","Brejo Grande","Agudos","Aparecida do Rio Negro"]
[11.0,"AC","Mâncio Lima",11.0,"MA",null,null,null,null,null,"Jordão","Belo Monte","Barreirinha","Oiapoque","Almadina","Amontada",null,"Aracruz","Aloândia","Alto Parnaíba","Águas Formosas","Aquidauana","Apiacás","Anajás","Amparo","Altinho","Amarante","Altônia","Belford Roxo","Antônio Martins","Cacoal","Mucajaí","Alpestre","Alfredo Wagner","Campo do Brito","Alambari","Aragominas"]
[12.0,"AC","Manoel Urbano",12.0,"MG",null,null,null,null,null,"Mâncio Lima","Boca da Mata","Benjamin Constant","Pedra Branca do Amapari","Amargosa","Antonina do Norte",null,"Atilio Vivacqua","Alto Horizonte","Amapá do Maranhão","Águas Vermelhas","Aral Moreira","Araguaiana","Ananindeua","Aparecida","Amaraji","Angical do Piauí","Alvorada do Sul","Bom Jardim","Apodi","Campo Novo de Rondônia","Normandia","Alto Alegre","Alto Bela Vista","Canhoba","Alfredo Marcondes","Araguacema"]
[13.0,"AC","Marechal Thaumaturgo",13.0,"MS",null,null,null,null,null,"Manoel Urbano","Branquinha","Beruri","Porto Grande","Amélia Rodrigues","Apuiarés",null,"Baixo Guandu","Alto Paraíso de Goiás","Amarante do Maranhão","Aimorés","Bandeirantes","Araguainha","Anapu","Araçagi","Angelim","Anísio de Abreu","Amaporã","Bom Jesus do Itabapoana","Areia Branca","Candeias do Jamari","Pacaraima","Alto Feliz","Anchieta","Canindé de São Francisco","Altair","Araguaçu"]
[14.0,"AC","Plácido de Castro",14.0,"MT",null,null,null,null,null,"Marechal Thaumaturgo","Cacimbinhas","Boa Vista do Ramos","Pracuúba","América Dourada","Aquiraz",null,"Barra de São Francisco","Alvorada do Norte","Anajatuba","Aiuruoca","Bataguassu","Araputanga","Augusto Corrêa","Arara","Araçoiaba","Antônio Almeida","Ampére","Cabo Frio","Arês","Castanheiras","Rorainópolis","Alvorada","Angelina","Capela","Altinópolis","Araguaína"]
[15.0,"AC","Porto Acre",15.0,"PA",null,null,null,null,null,"Plácido de Castro","Cajueiro","Boca do Acre","Santana","Anagé","Aracati",null,"Boa Esperança","Amaralina","Anapurus","Alagoa","Batayporã","Arenápolis","Aurora do Pará","Araruna","Araripina","Aroazes","Anahy","Cachoeiras de Macacu","Augusto Severo","Cerejeiras","São João da Baliza","Amaral Ferrador","Anita Garibaldi","Carira","Alto Alegre","Araguanã"]
[16.0,"AC","Porto Walter",16.0,"PB",null,null,null,null,null,"Porto Acre","Campestre","Borba","Serra do Navio","Andaraí","Aracoiaba",null,"Bom Jesus do Norte","Americano do Brasil","Apicum-Açu","Albertina","Bela Vista","Aripuanã","Aveiro","Areia","Arcoverde","Aroeiras do Itaim","Andirá","Cambuci","Baía Formosa","Chupinguaia","São Luiz","Ametista do Sul","Anitápolis","Carmópolis","Alumínio","Araguatins"]
[17.0,"AC","Rio Branco",17.0,"PE",null,null,null,null,null,"Porto Walter","Campo Alegre","Caapiranga","Tartarugalzinho","Andorinha","Ararendá",null,"Brejetuba","Amorinópolis","Araguanã","Além Paraíba","Bodoquena","Barão de Melgaço","Bagre","Areia de Baraúnas","Barra de Guabiraba","Arraial","Ângulo","Campos dos Goytacazes","Baraúna","Colorado do Oeste","Uiramutã","André da Rocha","Antônio Carlos","Cedro de São João","Álvares Florence","Arapoema"]
[18.0,"AC","Rodrigues Alves",18.0,"PI",null,null,null,null,null,"Rio Branco","Campo Grande","Canutama","Vitória do Jari","Angical","Araripe",null,"Cachoeiro de Itapemirim","Anápolis","Araioses","Alfenas","Bonito","Barra do Bugres","Baião","Areial","Barreiros","Assunção do Piauí","Antonina","Cantagalo","Barcelona","Corumbiara",null,"Anta Gorda","Apiúna","Cristinápolis","Álvares Machado","Arraias"]
[19.0,"AC","Santa Rosa do Purus",19.0,"PR",null,null,null,null,null,"Rodrigues Alves","Canapi","Carauari",null,"Anguera","Aratuba",null,"Cariacica","Anhanguera","Arame","Alfredo Vasconcelos","Brasilândia","Barra do Garças","Bannach","Aroeiras","Belém de Maria","Avelino Lopes","Antônio Olinto","Carapebus","Bento Fernandes","Costa Marques",null,"Antônio Prado","Arabutã","Cumbe","Álvaro de Carvalho","Augustinópolis"]
[20.0,"AC","Sena Madureira",20.0,"RJ",null,null,null,null,null,"Santa Rosa do Purus","Capela","Careiro",null,"Antas","Arneiroz",null,"Castelo","Anicuns","Arari","Almenara","Caarapó","Bom Jesus do Araguaia","Barcarena","Assunção","Belém de São Francisco","Baixa Grande do Ribeiro","Apucarana","Cardoso Moreira","Bodó","Cujubim",null,"Arambaré","Araquari","Divina Pastora","Alvinlândia","Aurora do Tocantins"]
[21.0,"AC","Senador Guiomard",21.0,"RN",null,null,null,null,null,"Sena Madureira","Carneiros","Careiro da Várzea",null,"Antônio Cardoso","Assaré",null,"Colatina","Aparecida de Goiânia","Axixá","Alpercata","Camapuã","Brasnorte","Belém","Baía da Traição","Belo Jardim","Barra DAlcântara","Arapongas","Carmo","Bom Jesus","Espigão DOeste",null,"Araricá","Araranguá","Estância","Americana","Axixá do Tocantins"]
[22.0,"AC","Tarauacá",22.0,"RO",null,null,null,null,null,"Senador Guiomard","Chã Preta","Coari",null,"Antônio Gonçalves","Aurora",null,"Conceição da Barra","Aparecida do Rio Doce","Bacabal","Alpinópolis","Campo Grande","Cáceres","Belterra","Bananeiras","Betânia","Barras","Arapoti","Casimiro de Abreu","Brejinho","Governador Jorge Teixeira",null,"Aratiba","Armazém","Feira Nova","Américo Brasiliense","Babaçulândia"]
[23.0,"AC","Xapuri",23.0,"RR",null,null,null,null,null,"Tarauacá","Coité do Nóia","Codajás",null,"Aporá","Baixio",null,"Conceição do Castelo","Aporé","Bacabeira","Alterosa","Caracol","Campinápolis","Benevides","Baraúna","Bezerros","Barreiras do Piauí","Arapuã","Comendador Levy Gasparian","Caiçara do Norte","Guajará-Mirim",null,"Arroio do Meio","Arroio Trinta","Frei Paulo","Américo de Campos","Bandeirantes do Tocantins"]
[24.0,"AL","Água Branca",24.0,"RS",null,null,null,null,null,"Xapuri","Colônia Leopoldina","Eirunepé",null,"Apuarema","Banabuiú",null,"Divino de São Lourenço","Araçu","Bacuri","Alto Caparaó","Cassilândia","Campo Novo do Parecis","Bom Jesus do Tocantins","Barra de Santa Rosa","Bodocó","Barro Duro","Araruna","Conceição de Macabu","Caiçara do Rio do Vento","Itapuã do Oeste",null,"Arroio do Padre","Arvoredo","Gararu","Amparo","Barra do Ouro"]
[25.0,"AL","Anadia",25.0,"SC",null,null,null,null,null,null,"Coqueiro Seco","Envira",null,"Araças","Barbalha",null,"Domingos Martins","Aragarças","Bacurituba","Alto Jequitibá","Chapadão do Sul","Campo Verde","Bonito","Barra de Santana","Bom Conselho","Batalha","Araucária","Cordeiro","Caicó","Jaru",null,"Arroio do Sal","Ascurra","General Maynard","Analândia","Barrolândia"]
[26.0,"AL","Arapiraca",26.0,"SE",null,null,null,null,null,null,"Coruripe","Fonte Boa",null,"Aracatu","Barreira",null,"Dores do Rio Preto","Aragoiânia","Balsas","Alto Rio Doce","Corguinho","Campos de Júlio","Bragança","Barra de São Miguel","Bom Jardim","Bela Vista do Piauí","Ariranha do Ivaí","Duas Barras","Campo Redondo","Ji-Paraná",null,"Arroio do Tigre","Atalanta","Gracho Cardoso","Andradina","Bernardo Sayão"]
[27.0,"AL","Atalaia",27.0,"SP",null,null,null,null,null,null,"Craíbas","Guajará",null,"Araci","Barro",null,"Ecoporanga","Araguapaz","Barão de Grajaú","Alvarenga","Coronel Sapucaia","Canabrava do Norte","Brasil Novo","Bayeux","Bonito","Belém do Piauí","Assaí","Duque de Caxias","Canguaretama","Machadinho DOeste",null,"Arroio dos Ratos","Aurora","Ilha das Flores","Angatuba","Bom Jesus do Tocantins"]
[28.0,"AL","Barra de Santo Antônio",28.0,"TO",null,null,null,null,null,null,"Delmiro Gouveia","Humaitá",null,"Aramari","Barroquinha",null,"Fundão","Arenópolis","Barra do Corda","Alvinópolis","Corumbá","Canarana","Brejo Grande do Araguaia","Belém","Brejão","Beneditinos","Assis Chateaubriand","Engenheiro Paulo de Frontin","Caraúbas","Ministro Andreazza",null,"Arroio Grande","Balneário Arroio do Silva","Indiaroba","Anhembi","Brasilândia do Tocantins"]
[29.0,"AL","Barra de São Miguel",null,null,null,null,null,null,null,null,"Dois Riachos","Ipixuna",null,"Arataca","Baturité",null,"Governador Lindenberg","Aruanã","Barreirinhas","Alvorada de Minas","Costa Rica","Carlinda","Breu Branco","Belém do Brejo do Cruz","Brejinho","Bertolínia","Astorga","Guapimirim","Carnaúba dos Dantas","Mirante da Serra",null,"Arvorezinha","Balneário Barra do Sul","Itabaiana","Anhumas","Brejinho de Nazaré"]
[30.0,"AL","Batalha",1.0,null,null,null,null,null,null,null,"Estrela de Alagoas","Iranduba",null,"Aratuípe","Beberibe",null,"Guaçuí","Aurilândia","Bela Vista do Maranhão","Amparo do Serra","Coxim","Castanheira","Breves","Bernardino Batista","Brejo da Madre de Deus","Betânia do Piauí","Atalaia","Iguaba Grande","Carnaubais","Monte Negro",null,"Augusto Pestana","Balneário Camboriú","Itabaianinha","Aparecida","Buriti do Tocantins"]
{"$rows_left_out":5541}